Reaction Details
TargetMatrix metalloproteinase-9
LigandBDBM50143731
Substrate/Competitorn/a
Meas. Tech.ChEMBL_105384 (CHEMBL710803)
Ki 2±n/a nM
Citation Moriyama, HTsukida, TInoue, YYokota, KYoshino, KKondo, HMiura, NNishimura, S Azasugar-based MMP/ADAM inhibitors as antipsoriatic agents. J Med Chem47:1930-8 (2004) 
 
Matrix metalloproteinase-9
Name:Matrix metalloproteinase-9
Type:Enzyme
Mol. Mass.:78452.28
Organism:Homo sapiens (Human)
Description:P14780
Residue:707
BDBM50143731
NameBDBM50143731
Synonyms:(2R,3R,4R,5R)-3,4,5-Trihydroxy-1-(4-methoxy-benzenesulfonyl)-piperidine-2-carboxylic acid hydroxyamide | CHEMBL57644
TypeSmall organic molecule
Emp. Form.C13H18N2O8S
Mol. Mass.362.356
SMILESCOc1ccc(cc1)S(=O)(=O)N1C[C@@H](O)[C@@H](O)[C@H](O)[C@@H]1C(=O)NO