Reaction Details
TargetDisintegrin and metalloproteinase domain-containing protein 17
LigandBDBM50143729
Substrate/Competitorn/a
Meas. Tech.ChEMBL_212581 (CHEMBL811883)
Ki 6.2±n/a nM
Citation Moriyama, HTsukida, TInoue, YYokota, KYoshino, KKondo, HMiura, NNishimura, S Azasugar-based MMP/ADAM inhibitors as antipsoriatic agents. J Med Chem47:1930-8 (2004) 
 
Disintegrin and metalloproteinase domain-containing protein 17
Name:Disintegrin and metalloproteinase domain-containing protein 17
Type:Enzyme
Mol. Mass.:93007.89
Organism:Homo sapiens (Human)
Description:
Residue:824
BDBM50143729
NameBDBM50143729
Synonyms:(2R,3R,4R,5R)-3,4,5-Trihydroxy-1-(4-phenoxy-benzenesulfonyl)-piperidine-2-carboxylic acid hydroxyamide | CHEMBL56837
TypeSmall organic molecule
Emp. Form.C18H20N2O8S
Mol. Mass.424.425
SMILESONC(=O)[C@H]1[C@@H](O)[C@H](O)[C@H](O)CN1S(=O)(=O)c1ccc(Oc2ccccc2)cc1