Reaction Details
TargetC-C chemokine receptor type 5
LigandBDBM50143734
Substrate/Competitorn/a
Meas. Tech.ChEMBL_39506 (CHEMBL654035)
IC50 0.6±n/a nM
Citation Thoma, GNuninger, FSchaefer, MAkyel, KGAlbert, RBeerli, CBruns, CFrancotte, ELuyten, MMacKenzie, DOberer, LStreiff, MBWagner, TWalter, HWeckbecker, GZerwes, HG Orally bioavailable competitive CCR5 antagonists. J Med Chem47:1939-55 (2004) 
 
C-C chemokine receptor type 5
Name:C-C chemokine receptor type 5
Type:Enzyme
Mol. Mass.:40540.21
Organism:Homo sapiens (Human)
Description:P51681
Residue:352
BDBM50143734
NameBDBM50143734
Synonyms:3-({[1'-(2,4-Dimethyl-1-oxy-pyridine-3-carbonyl)-4'-methyl-[1,4']bipiperidinyl-4-yl]-phenyl-amino}-methyl)-benzonitrile | CHEMBL59511
TypeSmall organic molecule
Emp. Form.C33H39N5O2
Mol. Mass.537.6951
SMILESCc1cc[n+]([O-])c(C)c1C(=O)N1CCC(C)(CC1)N1CCC(CC1)N(Cc1cccc(c1)C#N)c1ccccc1