Reaction Details
TargetC-C chemokine receptor type 5
LigandBDBM50143745
Substrate/Competitorn/a
Meas. Tech.ChEMBL_39506 (CHEMBL654035)
IC50 2.3±n/a nM
Citation Thoma, GNuninger, FSchaefer, MAkyel, KGAlbert, RBeerli, CBruns, CFrancotte, ELuyten, MMacKenzie, DOberer, LStreiff, MBWagner, TWalter, HWeckbecker, GZerwes, HG Orally bioavailable competitive CCR5 antagonists. J Med Chem47:1939-55 (2004) 
 
C-C chemokine receptor type 5
Name:C-C chemokine receptor type 5
Type:Enzyme
Mol. Mass.:40540.21
Organism:Homo sapiens (Human)
Description:P51681
Residue:352
BDBM50143745
NameBDBM50143745
Synonyms:CHEMBL60225 | {4-[Benzyl-(4-bromo-phenyl)-amino]-4'-methyl-[1,4']bipiperidinyl-1'-yl}-(2,6-dimethyl-phenyl)-methanone
TypeSmall organic molecule
Emp. Form.C33H40BrN3O
Mol. Mass.574.594
SMILESCc1cccc(C)c1C(=O)N1CCC(C)(CC1)N1CCC(CC1)N(Cc1ccccc1)c1ccc(Br)cc1