Reaction Details
TargetC-C chemokine receptor type 5
LigandBDBM50143743
Substrate/Competitorn/a
Meas. Tech.ChEMBL_39506 (CHEMBL654035)
IC50 2±n/a nM
Citation Thoma, GNuninger, FSchaefer, MAkyel, KGAlbert, RBeerli, CBruns, CFrancotte, ELuyten, MMacKenzie, DOberer, LStreiff, MBWagner, TWalter, HWeckbecker, GZerwes, HG Orally bioavailable competitive CCR5 antagonists. J Med Chem47:1939-55 (2004) 
 
C-C chemokine receptor type 5
Name:C-C chemokine receptor type 5
Type:Enzyme
Mol. Mass.:40540.21
Organism:Homo sapiens (Human)
Description:P51681
Residue:352
BDBM50143743
NameBDBM50143743
Synonyms:CHEMBL61536 | [4-(Benzyl-phenyl-amino)-4'-methyl-[1,4']bipiperidinyl-1'-yl]-(2,4-dimethyl-1-oxy-pyridin-3-yl)-methanone
TypeSmall organic molecule
Emp. Form.C32H40N4O2
Mol. Mass.512.6856
SMILESCc1cc[n+]([O-])c(C)c1C(=O)N1CCC(C)(CC1)N1CCC(CC1)N(Cc1ccccc1)c1ccccc1