Reaction Details
TargetRetinoic acid receptor RXR-alpha
LigandBDBM50143828
Substrate/Competitorn/a
Meas. Tech.ChEMBL_196486 (CHEMBL798300)
Ki 200±n/a nM
Citation Haffner, CDLenhard, JMMiller, ABMcDougald, DLDwornik, KIttoop, ORGampe, RTXu, HEBlanchard, SMontana, VGConsler, TGBledsoe, RKAyscue, ACroom, D Structure-based design of potent retinoid X receptor alpha agonists. J Med Chem47:2010-29 (2004) 
 
Retinoic acid receptor RXR-alpha
Name:Retinoic acid receptor RXR-alpha
Type:PROTEIN
Mol. Mass.:50820.38
Organism:Homo sapiens (Human)
Description:ChEMBL_1456363
Residue:462
BDBM50143828
NameBDBM50143828
Synonyms:3-[4-(5,5,8,8-Tetramethyl-5,6,7,8-tetrahydro-naphthalen-2-yl)-4,5,6,7-tetrahydro-benzo[b]thiophen-2-yl]-propionic acid | CHEMBL60090
TypeSmall organic molecule
Emp. Form.C25H32O2S
Mol. Mass.396.585
SMILESCC1(C)CCC(C)(C)c2cc(ccc12)C1CCCc2sc(CCC(O)=O)cc12