Reaction Details
TargetRetinoic acid receptor alpha
LigandBDBM50409928
Substrate/Competitorn/a
Meas. Tech.ChEMBL_197411 (CHEMBL799800)
Ki>1000±n/a nM
Citation Haffner, CDLenhard, JMMiller, ABMcDougald, DLDwornik, KIttoop, ORGampe, RTXu, HEBlanchard, SMontana, VGConsler, TGBledsoe, RKAyscue, ACroom, D Structure-based design of potent retinoid X receptor alpha agonists. J Med Chem47:2010-29 (2004) 
 
Retinoic acid receptor alpha
Name:Retinoic acid receptor alpha
Type:PROTEIN
Mol. Mass.:50778.87
Organism:Homo sapiens (Human)
Description:ChEMBL_1466191
Residue:462
BDBM50409928
NameBDBM50409928
Synonyms:CHEMBL2113737
TypeSmall organic molecule
Emp. Form.C26H32O3
Mol. Mass.392.5305
SMILESC\C(=C/C(O)=O)c1cc2C(CCCc2o1)c1ccc2c(c1)C(C)(C)CCC2(C)C