Reaction Details
TargetIntegrin alpha-IIb/beta-3
LigandBDBM50143842
Substrate/Competitorn/a
Meas. Tech.ChEMBL_70162 (CHEMBL683382)
IC50 4±n/a nM
Citation Mehrotra, MMHeath, JASmyth, MSPandey, ARose, JWSeroogy, JMVolkots, DLNannizzi-Alaimo, LPark, GLLambing, JLHollenbach, SJScarborough, RM Discovery of novel 2,8-diazaspiro[4.5]decanes as orally active glycoprotein IIb-IIIa antagonists. J Med Chem47:2037-61 (2004) 
 
Integrin alpha-IIb/beta-3
Name:Integrin alpha-IIb/beta-3
Synonyms:Glycoprotein IIb/IIIa
Type:n/a
Mol. Mass.:n/a
Description:ASSAY_ID of EBI is 30109
Components:This complex has 2 components.
Component 1
Name:Integrin beta-3
Type:Protein
Mol. Mass.:87038.91
Organism:Homo sapiens (Human)
Description:P05106
Residue:788
Component 2
Name:Integrin alpha-IIb
Synonyms:CD_antigen=CD41 GPIIb Glycoprotein IIb ITGA2B Integrin alpha-IIb heavy chain Integrin alpha-IIb light chain, form 2 Integrin alpha-V/beta-3 and alpha-IIb/beta 3 | Platelet membrane glycoprotein IIb
Type:Protein
Mol. Mass.:113354.85
Organism:Homo sapiens (Human)
Description:P08514
Residue:1039
BDBM50143842
NameBDBM50143842
Synonyms:3-{[2-(4-Carbamimidoyl-phenyl)-1-oxo-2,8-diaza-spiro[4.5]decane-8-carbonyl]-amino}-propionic acid | CHEMBL65477
TypeSmall organic molecule
Emp. Form.C19H25N5O4
Mol. Mass.387.4329
SMILESNC(=N)c1ccc(cc1)N1CCC2(CCN(CC2)C(=O)NCCC(O)=O)C1=O