Reaction Details
TargetIntegrin alpha-IIb/beta-3
LigandBDBM50143871
Substrate/Competitorn/a
Meas. Tech.ChEMBL_90326 (CHEMBL699169)
IC50 120±n/a nM
Citation Mehrotra, MMHeath, JASmyth, MSPandey, ARose, JWSeroogy, JMVolkots, DLNannizzi-Alaimo, LPark, GLLambing, JLHollenbach, SJScarborough, RM Discovery of novel 2,8-diazaspiro[4.5]decanes as orally active glycoprotein IIb-IIIa antagonists. J Med Chem47:2037-61 (2004) 
 
Integrin alpha-IIb/beta-3
Name:Integrin alpha-IIb/beta-3
Synonyms:Glycoprotein IIb/IIIa
Type:n/a
Mol. Mass.:n/a
Description:ASSAY_ID of EBI is 30109
Components:This complex has 2 components.
Component 1
Name:Integrin beta-3
Type:Protein
Mol. Mass.:87038.91
Organism:Homo sapiens (Human)
Description:P05106
Residue:788
Component 2
Name:Integrin alpha-IIb
Synonyms:CD_antigen=CD41 GPIIb Glycoprotein IIb ITGA2B Integrin alpha-IIb heavy chain Integrin alpha-IIb light chain, form 2 Integrin alpha-V/beta-3 and alpha-IIb/beta 3 | Platelet membrane glycoprotein IIb
Type:Protein
Mol. Mass.:113354.85
Organism:Homo sapiens (Human)
Description:P08514
Residue:1039
BDBM50143871
NameBDBM50143871
Synonyms:5-[3-(4-Carbamimidoyl-phenyl)-1-methyl-2,4-dioxo-1,3,8-triaza-spiro[4.5]dec-8-yl]-5-oxo-3-phenyl-pentanoic acid | CHEMBL64101
TypeSmall organic molecule
Emp. Form.C26H29N5O5
Mol. Mass.491.539
SMILESCN1C(=O)N(C(=O)C11CCN(CC1)C(=O)CC(CC(O)=O)c1ccccc1)c1ccc(cc1)C(N)=N