Reaction Details
TargetGlucagon receptor
LigandBDBM50144000
Substrate/Competitorn/a
Meas. Tech.ChEBML_72991
Ki 73±n/a nM
Citation Kurukulasuriya, RSorensen, BKLink, JTPatel, JRJae, HSWinn, MXRohde, JRGrihalde, NDLin, CWOgiela, CAAdler, ALCollins, CA Biaryl amide glucagon receptor antagonists. Bioorg Med Chem Lett14:2047-50 (2004) 
 
Glucagon receptor
Name:Glucagon receptor
Type:Enzyme
Mol. Mass.:54026.92
Organism:Homo sapiens (Human)
Description:P47871
Residue:477
BDBM50144000
NameBDBM50144000
Synonyms:3-{4-[2-(4-tert-Butyl-phenyl)-2-(4-piperidin-1-yl-phenylcarbamoyl)-ethyl]-benzoylamino}-propionic acid | CHEMBL63923
TypeSmall organic molecule
Emp. Form.C34H41N3O4
Mol. Mass.555.707
SMILESCC(C)(C)c1ccc(cc1)C(Cc1ccc(cc1)C(=O)NCCC(O)=O)C(=O)Nc1ccc(cc1)N1CCCCC1