Reaction Details
TargetGlucagon receptor
LigandBDBM50144003
Substrate/Competitorn/a
Meas. Tech.ChEBML_72991
Ki 51±n/a nM
Citation Kurukulasuriya, RSorensen, BKLink, JTPatel, JRJae, HSWinn, MXRohde, JRGrihalde, NDLin, CWOgiela, CAAdler, ALCollins, CA Biaryl amide glucagon receptor antagonists. Bioorg Med Chem Lett14:2047-50 (2004) 
 
Glucagon receptor
Name:Glucagon receptor
Type:Enzyme
Mol. Mass.:54026.92
Organism:Homo sapiens (Human)
Description:P47871
Residue:477
BDBM50144003
NameBDBM50144003
Synonyms:3-{4-[2-(4-tert-Butyl-phenyl)-2-(4-trifluoromethoxy-phenylcarbamoyl)-ethyl]-benzoylamino}-propionic acid | CHEMBL62412
TypeSmall organic molecule
Emp. Form.C30H31F3N2O5
Mol. Mass.556.5727
SMILESCC(C)(C)c1ccc(cc1)C(Cc1ccc(cc1)C(=O)NCCC(O)=O)C(=O)Nc1ccc(OC(F)(F)F)cc1