Reaction Details
TargetGlucagon receptor
LigandBDBM50144012
Substrate/Competitorn/a
Meas. Tech.ChEBML_72991
Ki 66±n/a nM
Citation Kurukulasuriya, RSorensen, BKLink, JTPatel, JRJae, HSWinn, MXRohde, JRGrihalde, NDLin, CWOgiela, CAAdler, ALCollins, CA Biaryl amide glucagon receptor antagonists. Bioorg Med Chem Lett14:2047-50 (2004) 
 
Glucagon receptor
Name:Glucagon receptor
Type:Enzyme
Mol. Mass.:54026.92
Organism:Homo sapiens (Human)
Description:P47871
Residue:477
BDBM50144012
NameBDBM50144012
Synonyms:4-[(Biphenyl-4-ylcarbamoyl)-(4-tert-butyl-phenyl)-methoxy]-N-(2H-tetrazol-5-yl)-benzamide | CHEMBL64646
TypeSmall organic molecule
Emp. Form.C32H30N6O3
Mol. Mass.546.619
SMILESCC(C)(C)c1ccc(cc1)C(Oc1ccc(cc1)C(=O)Nc1nnn[nH]1)C(=O)Nc1ccc(cc1)-c1ccccc1