Reaction Details
TargetGlucagon receptor
LigandBDBM50144015
Substrate/Competitorn/a
Meas. Tech.ChEBML_72991
Ki 6±n/a nM
Citation Kurukulasuriya, RSorensen, BKLink, JTPatel, JRJae, HSWinn, MXRohde, JRGrihalde, NDLin, CWOgiela, CAAdler, ALCollins, CA Biaryl amide glucagon receptor antagonists. Bioorg Med Chem Lett14:2047-50 (2004) 
 
Glucagon receptor
Name:Glucagon receptor
Type:Enzyme
Mol. Mass.:54026.92
Organism:Homo sapiens (Human)
Description:P47871
Residue:477
BDBM50144015
NameBDBM50144015
Synonyms:3-{4-[2-(4-Benzofuran-2-yl-phenylcarbamoyl)-octyl]-benzoylamino}-propionic acid | CHEMBL293907
TypeSmall organic molecule
Emp. Form.C33H36N2O5
Mol. Mass.540.6493
SMILESCCCCCCC(Cc1ccc(cc1)C(=O)NCCC(O)=O)C(=O)Nc1ccc(cc1)-c1cc2ccccc2o1