Reaction Details
TargetCoagulation factor X
LigandBDBM50144102
Substrate/Competitorn/a
Meas. Tech.ChEBML_48628
IC50 160±n/a nM
Citation Jia, ZJSu, TZuckett, JFWu, YGoldman, EALi, WZhang, PClizbe, LASong, YBauer, SMHuang, WWoolfrey, JSinha, UArfsten, AEHutchaleelaha, AHollenbach, SJLambing, JLScarborough, RMZhu, BY N,N-Dialkylated 4-(4-arylsulfonylpiperazine-1-carbonyl)-benzamidines and 4-((4-arylsulfonyl)-2-oxo-piperazin-1-ylmethyl)-benzamidines as potent factor Xa inhibitors. Bioorg Med Chem Lett14:2073-8 (2004) 
 
Coagulation factor X
Name:Coagulation factor X
Type:Enzyme
Mol. Mass.:54726.60
Organism:Homo sapiens (Human)
Description:n/a
Residue:488
BDBM50144102
NameBDBM50144102
Synonyms:CHEMBL302178 | [4-(6-Bromo-naphthalene-2-sulfonyl)-piperazin-1-yl]-[4-(imino-piperidin-1-yl-methyl)-phenyl]-methanone
TypeSmall organic molecule
Emp. Form.C27H29BrN4O3S
Mol. Mass.569.513
SMILESBrc1ccc2cc(ccc2c1)S(=O)(=O)N1CCN(CC1)C(=O)c1ccc(cc1)C(=N)N1CCCCC1