Reaction Details
TargetCoagulation factor X
LigandBDBM50144103
Substrate/Competitorn/a
Meas. Tech.ChEBML_48628
IC50 24±n/a nM
Citation Jia, ZJSu, TZuckett, JFWu, YGoldman, EALi, WZhang, PClizbe, LASong, YBauer, SMHuang, WWoolfrey, JSinha, UArfsten, AEHutchaleelaha, AHollenbach, SJLambing, JLScarborough, RMZhu, BY N,N-Dialkylated 4-(4-arylsulfonylpiperazine-1-carbonyl)-benzamidines and 4-((4-arylsulfonyl)-2-oxo-piperazin-1-ylmethyl)-benzamidines as potent factor Xa inhibitors. Bioorg Med Chem Lett14:2073-8 (2004) 
 
Coagulation factor X
Name:Coagulation factor X
Type:Enzyme
Mol. Mass.:54726.60
Organism:Homo sapiens (Human)
Description:n/a
Residue:488
BDBM50144103
NameBDBM50144103
Synonyms:CHEMBL417738 | [4-(Azetidin-1-yl-imino-methyl)-phenyl]-[4-(5-chloro-1H-indole-2-sulfonyl)-piperazin-1-yl]-methanone
TypeSmall organic molecule
Emp. Form.C23H24ClN5O3S
Mol. Mass.485.986
SMILESClc1ccc2[nH]c(cc2c1)S(=O)(=O)N1CCN(CC1)C(=O)c1ccc(cc1)C(=N)N1CCC1