Reaction Details
TargetCoagulation factor X
LigandBDBM50144108
Substrate/Competitorn/a
Meas. Tech.ChEBML_48628
IC50 45±n/a nM
Citation Jia, ZJSu, TZuckett, JFWu, YGoldman, EALi, WZhang, PClizbe, LASong, YBauer, SMHuang, WWoolfrey, JSinha, UArfsten, AEHutchaleelaha, AHollenbach, SJLambing, JLScarborough, RMZhu, BY N,N-Dialkylated 4-(4-arylsulfonylpiperazine-1-carbonyl)-benzamidines and 4-((4-arylsulfonyl)-2-oxo-piperazin-1-ylmethyl)-benzamidines as potent factor Xa inhibitors. Bioorg Med Chem Lett14:2073-8 (2004) 
 
Coagulation factor X
Name:Coagulation factor X
Type:Enzyme
Mol. Mass.:54726.60
Organism:Homo sapiens (Human)
Description:n/a
Residue:488
BDBM50144108
NameBDBM50144108
Synonyms:4-(6-Chloro-benzo[b]thiophene-2-sulfonyl)-1-[4-(1-methyl-4,5-dihydro-1H-imidazol-2-yl)-benzyl]-piperazin-2-one | CHEMBL302968
TypeSmall organic molecule
Emp. Form.C23H23ClN4O3S2
Mol. Mass.503.037
SMILESCN1CCN=C1c1ccc(CN2CCN(CC2=O)S(=O)(=O)c2cc3ccc(Cl)cc3s2)cc1