Reaction Details
TargetCoagulation factor X
LigandBDBM50144109
Substrate/Competitorn/a
Meas. Tech.ChEBML_48628
IC50 31±n/a nM
Citation Jia, ZJSu, TZuckett, JFWu, YGoldman, EALi, WZhang, PClizbe, LASong, YBauer, SMHuang, WWoolfrey, JSinha, UArfsten, AEHutchaleelaha, AHollenbach, SJLambing, JLScarborough, RMZhu, BY N,N-Dialkylated 4-(4-arylsulfonylpiperazine-1-carbonyl)-benzamidines and 4-((4-arylsulfonyl)-2-oxo-piperazin-1-ylmethyl)-benzamidines as potent factor Xa inhibitors. Bioorg Med Chem Lett14:2073-8 (2004) 
 
Coagulation factor X
Name:Coagulation factor X
Type:Enzyme
Mol. Mass.:54726.60
Organism:Homo sapiens (Human)
Description:n/a
Residue:488
BDBM50144109
NameBDBM50144109
Synonyms:CHEMBL66535 | [4-(6-Bromo-naphthalene-2-sulfonyl)-piperazin-1-yl]-[4-(1-methyl-4,5-dihydro-1H-imidazol-2-yl)-phenyl]-methanone
TypeSmall organic molecule
Emp. Form.C25H25BrN4O3S
Mol. Mass.541.46
SMILESCN1CCN=C1c1ccc(cc1)C(=O)N1CCN(CC1)S(=O)(=O)c1ccc2cc(Br)ccc2c1