Reaction Details
TargetCoagulation factor X
LigandBDBM50144131
Substrate/Competitorn/a
Meas. Tech.ChEBML_48628
IC50 27±n/a nM
Citation Jia, ZJSu, TZuckett, JFWu, YGoldman, EALi, WZhang, PClizbe, LASong, YBauer, SMHuang, WWoolfrey, JSinha, UArfsten, AEHutchaleelaha, AHollenbach, SJLambing, JLScarborough, RMZhu, BY N,N-Dialkylated 4-(4-arylsulfonylpiperazine-1-carbonyl)-benzamidines and 4-((4-arylsulfonyl)-2-oxo-piperazin-1-ylmethyl)-benzamidines as potent factor Xa inhibitors. Bioorg Med Chem Lett14:2073-8 (2004) 
 
Coagulation factor X
Name:Coagulation factor X
Type:Enzyme
Mol. Mass.:54726.60
Organism:Homo sapiens (Human)
Description:n/a
Residue:488
BDBM50144131
NameBDBM50144131
Synonyms:4-[4-(5-Chloro-1H-indole-2-sulfonyl)-piperazine-1-carbonyl]-N-ethyl-N-methyl-benzamidine | CHEMBL65978
TypeSmall organic molecule
Emp. Form.C23H26ClN5O3S
Mol. Mass.488.002
SMILESCCN(C)C(=N)c1ccc(cc1)C(=O)N1CCN(CC1)S(=O)(=O)c1cc2cc(Cl)ccc2[nH]1