Reaction Details
TargetDelta-type opioid receptor
LigandBDBM50144240
Substrate/Competitorn/a
Meas. Tech.ChEMBL_145310 (CHEMBL751916)
EC50 623±n/a nM
Citation Carson, JRCoats, SJCodd, EEDax, SLLee, JMartinez, RPNeilson, LAPitis, PMZhang, SP N,N-dialkyl-4-[(8-azabicyclo[3.2.1]-oct-3-ylidene)phenylmethyl]benzamides, potent, selective delta opioid agonists. Bioorg Med Chem Lett14:2109-12 (2004) 
 
Delta-type opioid receptor
Name:Delta-type opioid receptor
Type:G Protein-Coupled Receptor (GPCR)
Mol. Mass.:40382.98
Organism:Homo sapiens (Human)
Description:Competition binding assays were carried out using membrane preparations from transfected HN9.10 cells that constitutively expressed the delta opioid receptor.
Residue:372
BDBM50144240
NameBDBM50144240
Synonyms:CHEMBL65151 | N,N-Diethyl-4-{[8-(2-phenoxy-ethyl)-8-aza-bicyclo[3.2.1]oct-3-ylidene]-phenyl-methyl}-benzamide
TypeSmall organic molecule
Emp. Form.C33H38N2O2
Mol. Mass.494.667
SMILES[#6]-[#6]-[#7](-[#6]-[#6])-[#6](=O)-c1ccc(cc1)-[#6](=[#6]-1\[#6]-[#6]-2-[#6]-[#6]-[#6](-[#6]-1)-[#7]-2-[#6]-[#6]-[#8]-c1ccccc1)\c1ccccc1