Reaction Details
TargetDelta-type opioid receptor
LigandBDBM50144282
Substrate/Competitorn/a
Meas. Tech.ChEBML_147341
Ki 0.384000±n/a nM
Citation Carson, JRCoats, SJCodd, EEDax, SLLee, JMartinez, RPMcKown, LAAnne Neilson, LPitis, PMWu, WNZhang, SP N-alkyl-4-[(8-azabicyclo[3.2.1]-oct-3-ylidene)phenylmethyl]benzamides, micro and delta opioid agonists: a micro address. Bioorg Med Chem Lett14:2113-6 (2004) 
 
Delta-type opioid receptor
Name:Delta-type opioid receptor
Type:G Protein-Coupled Receptor (GPCR)
Mol. Mass.:40382.98
Organism:Homo sapiens (Human)
Description:Competition binding assays were carried out using membrane preparations from transfected HN9.10 cells that constitutively expressed the delta opioid receptor.
Residue:372
BDBM50144282
NameBDBM50144282
Synonyms:4-[(8-Allyl-8-aza-bicyclo[3.2.1]oct-3-ylidene)-(3-hydroxy-phenyl)-methyl]-N-ethyl-benzamide | CHEMBL434018
TypeSmall organic molecule
Emp. Form.C26H30N2O2
Mol. Mass.402.5286
SMILES[#6]-[#6]-[#7]-[#6](=O)-c1ccc(cc1)-[#6](=[#6]-1/[#6]-[#6]-2-[#6]-[#6]-[#6](-[#6]-1)-[#7]-2-[#6]-[#6]=[#6])\c1cccc(-[#8])c1