Reaction Details
TargetProtein farnesyltransferase subunit beta/geranylgeranyltransferase type-1 subunit alpha
LigandBDBM50144314
Substrate/Competitorn/a
Meas. Tech.ChEMBL_70753 (CHEMBL682841)
Ki 8800±n/a nM
Citation Liu, XHPrestwich, GD Didehydrofarnesyl diphosphate: an intrinsically fluorescent inhibitor of protein farnesyltransferase. Bioorg Med Chem Lett14:2137-40 (2004) 
 
Protein farnesyltransferase subunit beta/geranylgeranyltransferase type-1 subunit alpha
Name:Protein farnesyltransferase subunit beta/geranylgeranyltransferase type-1 subunit alpha
Type:n/a
Mol. Mass.:n/a
Description:ASSAY_ID of EBI is 70753
Components:This complex has 2 components.
Component 1
Name:Protein farnesyltransferase subunit beta
Synonyms:CAAX farnesyltransferase subunit beta FNTB_YEAST Farnesyltransferase Ras proteins prenyltransferase subunit beta STE16
Type:Protein
Mol. Mass.:48188.41
Organism:Saccharomyces cerevisiae (Baker's yeast)
Description:P22007
Residue:431
Component 2
Name:Protein farnesyltransferase/geranylgeranyltransferase type-1 subunit alpha
Synonyms:CAAX farnesyltransferase subunit alpha FTase-alpha GGTase-I-alpha Protein farnesyltransferase/geranylgeranyltransferase type-1 subunit alpha Ras proteins prenyltransferase subunit alpha | Type I protein geranyl-geranyltransferase subunit alpha
Type:PROTEIN
Mol. Mass.:37495.69
Organism:Saccharomyces cerevisiae
Description:ChEMBL_588425
Residue:316
BDBM50144314
NameBDBM50144314
Synonyms:(2E,4E,6E,8E)-3,7,11-trimethyldodeca-2,4,6,8,10-pentaenyl trihydrogen diphosphate | CHEMBL69329
TypeSmall organic molecule
Emp. Form.C15H24O7P2
Mol. Mass.378.2944
SMILES[#6]\[#6](-[#6])=[#6]/[#6]=[#6]/[#6](/[#6])=[#6]/[#6]=[#6]/[#6](/[#6])=[#6]/[#6]-[#8]P([#8])(=O)[#8]P([#8])([#8])=O