Reaction Details
TargetCarboxypeptidase B2
LigandBDBM50144329
Substrate/Competitorn/a
Meas. Tech.ChEBML_206146
IC50 3300±n/a nM
Citation Nantermet, PGBarrow, JCLindsley, SRYoung, MMao, SSCarroll, SBailey, CBosserman, MColussi, DMcMasters, DRVacca, JPSelnick, HG Imidazole acetic acid TAFIa inhibitors: SAR studies centered around the basic P(1)(') group. Bioorg Med Chem Lett14:2141-5 (2004) 
 
Carboxypeptidase B2
Name:Carboxypeptidase B2
Type:Enzyme
Mol. Mass.:48432.74
Organism:Homo sapiens (Human)
Description:Q96IY4
Residue:423
BDBM50144329
NameBDBM50144329
Synonyms:3-Imidazo[1,2-a]pyridin-6-yl-2-(1H-imidazol-4-yl)-propionic acid | CHEMBL67191
TypeSmall organic molecule
Emp. Form.C13H12N4O2
Mol. Mass.256.26
SMILESOC(=O)C(Cc1ccc2nccn2c1)c1cnc[nH]1