Reaction Details
TargetCarboxypeptidase B2
LigandBDBM50144332
Substrate/Competitorn/a
Meas. Tech.ChEBML_206146
IC50 5300±n/a nM
Citation Nantermet, PGBarrow, JCLindsley, SRYoung, MMao, SSCarroll, SBailey, CBosserman, MColussi, DMcMasters, DRVacca, JPSelnick, HG Imidazole acetic acid TAFIa inhibitors: SAR studies centered around the basic P(1)(') group. Bioorg Med Chem Lett14:2141-5 (2004) 
 
Carboxypeptidase B2
Name:Carboxypeptidase B2
Type:Enzyme
Mol. Mass.:48432.74
Organism:Homo sapiens (Human)
Description:Q96IY4
Residue:423
BDBM50144332
NameBDBM50144332
Synonyms:3-(6-Amino-5-chloro-pyridin-3-yl)-2-(1H-imidazol-4-yl)-propionic acid | CHEMBL305502
TypeSmall organic molecule
Emp. Form.C11H11ClN4O2
Mol. Mass.266.684
SMILESNc1ncc(CC(C(O)=O)c2cnc[nH]2)cc1Cl