Reaction Details
TargetCarboxypeptidase B2
LigandBDBM50135934
Substrate/Competitorn/a
Meas. Tech.ChEBML_206146
IC50 5±n/a nM
Citation Nantermet, PGBarrow, JCLindsley, SRYoung, MMao, SSCarroll, SBailey, CBosserman, MColussi, DMcMasters, DRVacca, JPSelnick, HG Imidazole acetic acid TAFIa inhibitors: SAR studies centered around the basic P(1)(') group. Bioorg Med Chem Lett14:2141-5 (2004) 
 
Carboxypeptidase B2
Name:Carboxypeptidase B2
Type:Enzyme
Mol. Mass.:48432.74
Organism:Homo sapiens (Human)
Description:Q96IY4
Residue:423
BDBM50135934
NameBDBM50135934
Synonyms:3-(6-Amino-pyridin-3-yl)-2-[1-(3-methyl-butyl)-1H-imidazol-4-yl]-propionic acid | CHEMBL68399
TypeSmall organic molecule
Emp. Form.C16H22N4O2
Mol. Mass.302.3715
SMILESCC(C)CCn1cnc(c1)C(Cc1ccc(N)nc1)C(O)=O