Reaction Details
TargetCarboxypeptidase B2
LigandBDBM50144324
Substrate/Competitorn/a
Meas. Tech.ChEBML_206146
IC50 4700±n/a nM
Citation Nantermet, PGBarrow, JCLindsley, SRYoung, MMao, SSCarroll, SBailey, CBosserman, MColussi, DMcMasters, DRVacca, JPSelnick, HG Imidazole acetic acid TAFIa inhibitors: SAR studies centered around the basic P(1)(') group. Bioorg Med Chem Lett14:2141-5 (2004) 
 
Carboxypeptidase B2
Name:Carboxypeptidase B2
Type:Enzyme
Mol. Mass.:48432.74
Organism:Homo sapiens (Human)
Description:Q96IY4
Residue:423
BDBM50144324
NameBDBM50144324
Synonyms:7-Amino-2-(1H-imidazol-4-yl)-heptanoic acid | CHEMBL66577
TypeSmall organic molecule
Emp. Form.C10H17N3O2
Mol. Mass.211.2609
SMILESNCCCCCC(C(O)=O)c1cnc[nH]1