Reaction Details
TargetCarboxypeptidase B
LigandBDBM50144334
Substrate/Competitorn/a
Meas. Tech.ChEBML_45638
IC50 3700±n/a nM
Citation Nantermet, PGBarrow, JCLindsley, SRYoung, MMao, SSCarroll, SBailey, CBosserman, MColussi, DMcMasters, DRVacca, JPSelnick, HG Imidazole acetic acid TAFIa inhibitors: SAR studies centered around the basic P(1)(') group. Bioorg Med Chem Lett14:2141-5 (2004) 
 
Carboxypeptidase B
Name:Carboxypeptidase B
Type:Enzyme
Mol. Mass.:47367.43
Organism:Homo sapiens (Human)
Description:P15086
Residue:417
BDBM50144334
NameBDBM50144334
Synonyms:6-Amino-2-(1H-imidazol-4-yl)-hexanoic acid | CHEMBL65910
TypeSmall organic molecule
Emp. Form.C9H15N3O2
Mol. Mass.197.2343
SMILESNCCCCC(C(O)=O)c1cnc[nH]1