Reaction Details
TargetSigma non-opioid intracellular receptor 1
LigandBDBM50144509
Substrate/Competitorn/a
Meas. Tech.ChEBML_201915
Ki 0.800000±n/a nM
Citation Glennon, RAIsmaiel, AMAblordeppey, SEl-Ashmawy, MFisher, JB Thioxanthene-derived analogs as sigma(1) receptor ligands. Bioorg Med Chem Lett14:2217-20 (2004) 
 
Sigma non-opioid intracellular receptor 1
Name:Sigma non-opioid intracellular receptor 1
Type:Enzyme Catalytic Domain
Mol. Mass.:25124.85
Organism:Homo sapiens (Human)
Description:Q99720
Residue:223
BDBM50144509
NameBDBM50144509
Synonyms:4-Methyl-1-{3-[8aH-10lambda*4*-thioxanthen-(9E)-ylidene]-propyl}-piperidine | CHEMBL305218
TypeSmall organic molecule
Emp. Form.C22H25NS
Mol. Mass.335.506
SMILES[#6]-[#6]-1-[#6]-[#6]-[#7](-[#6]-[#6]\[#6]=[#6]-2/c3ccccc3-[#16]-c3ccccc-23)-[#6]-[#6]-1