Reaction Details
TargetFibroblast growth factor 1
LigandBDBM50144523
Substrate/Competitorn/a
Meas. Tech.ChEBML_70464
Kd 2340000±n/a nM
Citation Liu, LPing Li, CCochran, SFerro, V Application of the four-component Ugi condensation for the preparation of sulfated glycoconjugate libraries. Bioorg Med Chem Lett14:2221-6 (2004) 
 
Fibroblast growth factor 1
Name:Fibroblast growth factor 1
Type:Protein
Mol. Mass.:17461.01
Organism:Homo sapiens (Human)
Description:P05230
Residue:155
BDBM50144523
NameBDBM50144523
Synonyms:CHEMBL305519 | Sodium sulfated glycoconjugate derivative
TypeSmall organic molecule
Emp. Form.C16H23N2O23S5
Mol. Mass.771.681
SMILES[O-]S(=O)(=O)OCCN(CC(=O)NC1CCCCC1)C(=O)C1OC(OS([O-])(=O)=O)C(OS([O-])(=O)=O)C(OS([O-])(=O)=O)C1OS([O-])(=O)=O