Reaction Details
TargetFibroblast growth factor 2
LigandBDBM50144527
Substrate/Competitorn/a
Meas. Tech.ChEBML_70634
Kd 200000±n/a nM
Citation Liu, LPing Li, CCochran, SFerro, V Application of the four-component Ugi condensation for the preparation of sulfated glycoconjugate libraries. Bioorg Med Chem Lett14:2221-6 (2004) 
 
Fibroblast growth factor 2
Name:Fibroblast growth factor 2
Type:Protein
Mol. Mass.:30803.89
Organism:Homo sapiens (Human)
Description:P09038
Residue:288
BDBM50144527
NameBDBM50144527
Synonyms:CHEMBL3215305 | Sodium sulfated glycoconjugate derivative
TypeSmall organic molecule
Emp. Form.C24H33N2Na3O17S3
Mol. Mass.786.686
SMILES[Na+].[Na+].[Na+].CO[C@H]1O[C@@H](COCC(=O)N(CC(=O)NC2CCCCC2)Cc2ccccc2)[C@@H](OS([O-])(=O)=O)[C@H](OS([O-])(=O)=O)[C@H]1OS([O-])(=O)=O