Reaction Details
TargetFibroblast growth factor 1
LigandBDBM50144528
Substrate/Competitorn/a
Meas. Tech.ChEBML_70464
Kd 296000±n/a nM
Citation Liu, LPing Li, CCochran, SFerro, V Application of the four-component Ugi condensation for the preparation of sulfated glycoconjugate libraries. Bioorg Med Chem Lett14:2221-6 (2004) 
 
Fibroblast growth factor 1
Name:Fibroblast growth factor 1
Type:Protein
Mol. Mass.:17461.01
Organism:Homo sapiens (Human)
Description:P05230
Residue:155
BDBM50144528
NameBDBM50144528
Synonyms:CHEMBL3215306 | Sodium sulfated glycoconjugate derivative
TypeSmall organic molecule
Emp. Form.C19H30N2Na4O20S4
Mol. Mass.826.662
SMILES[Na+].[Na+].[Na+].[Na+].CO[C@H]1O[C@@H](COCC(=O)N(CCS([O-])(=O)=O)CC(=O)NC2CCCCC2)[C@@H](OS([O-])(=O)=O)[C@H](OS([O-])(=O)=O)[C@H]1OS([O-])(=O)=O