Reaction Details
TargetHistamine H1 receptor
LigandBDBM50144627
Substrate/Competitorn/a
Meas. Tech.ChEBML_84432
Ki 180±n/a nM
Citation Lewis, TABayless, LEckman, JBEllis, JLGrewal, GLibertine, LMarie Nicolas, JScannell, RTWels, BFWenberg, KWypij, DM 5-lipoxygenase inhibitors with histamine H(1) receptor antagonist activity. Bioorg Med Chem Lett14:2265-8 (2004) 
 
Histamine H1 receptor
Name:Histamine H1 receptor
Type:G Protein-Coupled Receptor (GPCR)
Mol. Mass.:55808.72
Organism:Homo sapiens (Human)
Description:Cell pellets from SK-N-MC cells transfected with human H1 receptor were used in binding assay.
Residue:487
BDBM50144627
NameBDBM50144627
Synonyms:CHEMBL74688 | [4-((2R,5R)-5-{4-[(R)-(4-Chloro-phenyl)-phenyl-methyl]-piperazin-1-ylmethyl}-tetrahydro-furan-2-yl)-but-3-ynyl]-N-hydroxyurea
TypeSmall organic molecule
Emp. Form.C27H33ClN4O3
Mol. Mass.497.029
SMILESNC(=O)N(O)CCC#C[C@H]1CC[C@H](CN2CCN(CC2)[C@H](c2ccccc2)c2ccc(Cl)cc2)O1