Reaction Details
TargetSodium-dependent noradrenaline transporter
LigandBDBM50010859
Substrate/Competitorn/a
Meas. Tech.ChEBML_143139
Ki 16±n/a nM
Citation Peddi, SRoth, BLGlennon, RAWestkaemper, RB Structural determinants for high 5-HT(2A) receptor affinity of spiro[9,10-dihydroanthracene]-9,3(')-pyrrolidine (SpAMDA). Bioorg Med Chem Lett14:2279-83 (2004) 
 
Sodium-dependent noradrenaline transporter
Name:Sodium-dependent noradrenaline transporter
Type:Multi-pass membrane protein
Mol. Mass.:69337.72
Organism:Homo sapiens (Human)
Description:P23975
Residue:617
BDBM50010859
NameBDBM50010859
Synonyms:CHEMBL11 IMIPRAMINE PAMOATE | Imipramin
TypeSmall organic molecule
Emp. Form.C19H24N2
Mol. Mass.280.4073
SMILESCN(C)CCCN1c2ccccc2CCc2ccccc12