Reaction Details
TargetSodium-dependent serotonin transporter
LigandBDBM50010859
Substrate/Competitorn/a
Meas. Tech.ChEBML_202160
Ki 5±n/a nM
Citation Peddi, SRoth, BLGlennon, RAWestkaemper, RB Structural determinants for high 5-HT(2A) receptor affinity of spiro[9,10-dihydroanthracene]-9,3(')-pyrrolidine (SpAMDA). Bioorg Med Chem Lett14:2279-83 (2004) 
 
Sodium-dependent serotonin transporter
Name:Sodium-dependent serotonin transporter
Type:Multi-pass membrane protein
Mol. Mass.:70322.51
Organism:Homo sapiens (Human)
Description:P31645
Residue:630
BDBM50010859
NameBDBM50010859
Synonyms:CHEMBL11 IMIPRAMINE PAMOATE | Imipramin
TypeSmall organic molecule
Emp. Form.C19H24N2
Mol. Mass.280.4073
SMILESCN(C)CCCN1c2ccccc2CCc2ccccc12