Reaction Details
TargetTransient receptor potential cation channel subfamily V member 1
LigandBDBM50130548
Substrate/Competitorn/a
Meas. Tech.ChEMBL_215815 (CHEMBL820104)
Ki 49±n/a nM
Citation Lee, JKang, SUChoi, HKLee, JLim, JOKil, MJJin, MKKim, KPSung, JHChung, SJHa, HJKim, YHPearce, LVTran, RLundberg, DJWang, YToth, ABlumberg, PM Analysis of structure-activity relationships for the 'B-region' of N-(3-acyloxy-2-benzylpropyl)-N(')-[4-(methylsulfonylamino)benzyl]thiourea analogues as vanilloid receptor antagonists: discovery of an N-hydroxythiourea analogue with potent analgesic activity. Bioorg Med Chem Lett14:2291-7 (2004) 
 
Transient receptor potential cation channel subfamily V member 1
Name:Transient receptor potential cation channel subfamily V member 1
Type:Transient Receptor
Mol. Mass.:94956.12
Organism:Rattus norvegicus (rat)
Description:O35433
Residue:838
BDBM50130548
NameBDBM50130548
Synonyms:2,2-Dimethyl-propionic acid 2-(3,4-dimethyl-benzyl)-3-[3-(4-methanesulfonylamino-3-methoxy-benzyl)-thioureido]-propyl ester | CHEMBL72561
TypeSmall organic molecule
Emp. Form.C27H39N3O5S2
Mol. Mass.549.746
SMILESCOc1cc(CNC(=S)NCC(COC(=O)C(C)(C)C)Cc2ccc(C)c(C)c2)ccc1NS(C)(=O)=O