Reaction Details
TargetTransient receptor potential cation channel subfamily V member 1
LigandBDBM50144672
Substrate/Competitorn/a
Meas. Tech.ChEBML_42207
Ki 546±n/a nM
Citation Lee, JKang, SUChoi, HKLee, JLim, JOKil, MJJin, MKKim, KPSung, JHChung, SJHa, HJKim, YHPearce, LVTran, RLundberg, DJWang, YToth, ABlumberg, PM Analysis of structure-activity relationships for the 'B-region' of N-(3-acyloxy-2-benzylpropyl)-N(')-[4-(methylsulfonylamino)benzyl]thiourea analogues as vanilloid receptor antagonists: discovery of an N-hydroxythiourea analogue with potent analgesic activity. Bioorg Med Chem Lett14:2291-7 (2004) 
 
Transient receptor potential cation channel subfamily V member 1
Name:Transient receptor potential cation channel subfamily V member 1
Type:Transient Receptor
Mol. Mass.:94956.12
Organism:Rattus norvegicus (rat)
Description:O35433
Residue:838
BDBM50144672
NameBDBM50144672
Synonyms:2,2-Dimethyl-propionic acid 2-(3,4-dimethyl-benzyl)-3-[3-(3-fluoro-4-methanesulfonylamino-benzyl)-thioureido-N-hydroxy]-propyl ester | CHEMBL308800
TypeSmall organic molecule
Emp. Form.C26H36FN3O5S2
Mol. Mass.553.71
SMILESCc1ccc(CC(CNC(=S)N(O)Cc2ccc(NS(C)(=O)=O)c(F)c2)COC(=O)C(C)(C)C)cc1C