Reaction Details
TargetTransient receptor potential cation channel subfamily V member 1
LigandBDBM50144664
Substrate/Competitorn/a
Meas. Tech.ChEMBL_215815 (CHEMBL820104)
Ki 1980±n/a nM
Citation Lee, JKang, SUChoi, HKLee, JLim, JOKil, MJJin, MKKim, KPSung, JHChung, SJHa, HJKim, YHPearce, LVTran, RLundberg, DJWang, YToth, ABlumberg, PM Analysis of structure-activity relationships for the 'B-region' of N-(3-acyloxy-2-benzylpropyl)-N(')-[4-(methylsulfonylamino)benzyl]thiourea analogues as vanilloid receptor antagonists: discovery of an N-hydroxythiourea analogue with potent analgesic activity. Bioorg Med Chem Lett14:2291-7 (2004) 
 
Transient receptor potential cation channel subfamily V member 1
Name:Transient receptor potential cation channel subfamily V member 1
Type:Transient Receptor
Mol. Mass.:94956.12
Organism:Rattus norvegicus (rat)
Description:O35433
Residue:838
BDBM50144664
NameBDBM50144664
Synonyms:2,2-Dimethyl-propionic acid 2-(3,4-dimethyl-benzyl)-3-[2-(4-methanesulfonylamino-phenyl)-acetoxy]-propyl ester | CHEMBL74329
TypeSmall organic molecule
Emp. Form.C26H35NO6S
Mol. Mass.489.624
SMILESCc1ccc(CC(COC(=O)Cc2ccc(NS(C)(=O)=O)cc2)COC(=O)C(C)(C)C)cc1C