Reaction Details
TargetTransient receptor potential cation channel subfamily V member 1
LigandBDBM50144674
Substrate/Competitorn/a
Meas. Tech.ChEBML_42207
Ki 199±n/a nM
Citation Lee, JKang, SUChoi, HKLee, JLim, JOKil, MJJin, MKKim, KPSung, JHChung, SJHa, HJKim, YHPearce, LVTran, RLundberg, DJWang, YToth, ABlumberg, PM Analysis of structure-activity relationships for the 'B-region' of N-(3-acyloxy-2-benzylpropyl)-N(')-[4-(methylsulfonylamino)benzyl]thiourea analogues as vanilloid receptor antagonists: discovery of an N-hydroxythiourea analogue with potent analgesic activity. Bioorg Med Chem Lett14:2291-7 (2004) 
 
Transient receptor potential cation channel subfamily V member 1
Name:Transient receptor potential cation channel subfamily V member 1
Type:Transient Receptor
Mol. Mass.:94956.12
Organism:Rattus norvegicus (rat)
Description:O35433
Residue:838
BDBM50144674
NameBDBM50144674
Synonyms:2,2-Dimethyl-propionic acid 2-(3,4-dimethyl-benzyl)-3-(4-methanesulfonylamino-3-methoxy-benzyloxythiocarbonylamino)-propyl ester | CHEMBL73789
TypeSmall organic molecule
Emp. Form.C27H38N2O6S2
Mol. Mass.550.73
SMILESCOc1cc(COC(=S)NCC(COC(=O)C(C)(C)C)Cc2ccc(C)c(C)c2)ccc1NS(C)(=O)=O