Reaction Details
Target1-acyl-sn-glycerol-3-phosphate acyltransferase beta
LigandBDBM50144724
Substrate/Competitorn/a
Meas. Tech.ChEBML_100168
IC50 54.0±n/a nM
Citation Gong, BHong, FKohm, CJenkins, STulinsky, JBhatt, RDe Vries, PSinger, JWKlein, P Synthesis, SAR, and antitumor properties of diamino-C,N-diarylpyrimidine positional isomers: inhibitors of lysophosphatidic acid acyltransferase-beta. Bioorg Med Chem Lett14:2303-8 (2004) 
 
1-acyl-sn-glycerol-3-phosphate acyltransferase beta
Name:1-acyl-sn-glycerol-3-phosphate acyltransferase beta
Type:PROTEIN
Mol. Mass.:30924.09
Organism:Homo sapiens (Human)
Description:ChEMBL_321473
Residue:278
BDBM50144724
NameBDBM50144724
Synonyms:6-(5-Chloro-2-methoxy-phenyl)-N*4*-(4-chloro-phenyl)-pyrimidine-2,4-diamine | CHEMBL306107
TypeSmall organic molecule
Emp. Form.C17H14Cl2N4O
Mol. Mass.361.225
SMILESCOc1ccc(Cl)cc1-c1cc(Nc2ccc(Cl)cc2)nc(N)n1