Reaction Details
Target5-hydroxytryptamine receptor 2B
LigandBDBM50144837
Substrate/Competitorn/a
Meas. Tech.ChEMBL_2865 (CHEMBL617407)
Ki 54±n/a nM
Citation Bentley, JMAdams, DRBebbington, DBenwell, KRBickerdike, MJDavidson, JEDawson, CEDourish, CTDuncton, MAGaur, SGeorge, ARGiles, PRHamlyn, RJKennett, GAKnight, ARMalcolm, CSMansell, HLMisra, AMonck, NJPratt, RMQuirk, KRoffey, JRVickers, SPCliffe, IA Indoline derivatives as 5-HT(2C) receptor agonists. Bioorg Med Chem Lett14:2367-70 (2004) 
 
5-hydroxytryptamine receptor 2B
Name:5-hydroxytryptamine receptor 2B
Type:G Protein-Coupled Receptor (GPCR)
Mol. Mass.:54312.47
Organism:Homo sapiens (Human)
Description:Receptor binding assays were performed using human clone stably expressed in CHO cells.
Residue:481
BDBM50144837
NameBDBM50144837
Synonyms:(S)-2-(6-Chloro-2,3-dihydro-indol-1-yl)-1-methyl-ethylamine | CHEMBL76307
TypeSmall organic molecule
Emp. Form.C11H15ClN2
Mol. Mass.210.703
SMILESC[C@H](N)CN1CCc2ccc(Cl)cc12