Reaction Details
Target5-hydroxytryptamine receptor 2B
LigandBDBM50144835
Substrate/Competitorn/a
Meas. Tech.ChEMBL_2865 (CHEMBL617407)
Ki 89±n/a nM
Citation Bentley, JMAdams, DRBebbington, DBenwell, KRBickerdike, MJDavidson, JEDawson, CEDourish, CTDuncton, MAGaur, SGeorge, ARGiles, PRHamlyn, RJKennett, GAKnight, ARMalcolm, CSMansell, HLMisra, AMonck, NJPratt, RMQuirk, KRoffey, JRVickers, SPCliffe, IA Indoline derivatives as 5-HT(2C) receptor agonists. Bioorg Med Chem Lett14:2367-70 (2004) 
 
5-hydroxytryptamine receptor 2B
Name:5-hydroxytryptamine receptor 2B
Type:G Protein-Coupled Receptor (GPCR)
Mol. Mass.:54312.47
Organism:Homo sapiens (Human)
Description:Receptor binding assays were performed using human clone stably expressed in CHO cells.
Residue:481
BDBM50144835
NameBDBM50144835
Synonyms:(S)-1-Methyl-2-(6-methylsulfanyl-2,3-dihydro-indol-1-yl)-ethylamine | CHEMBL451543
TypeSmall organic molecule
Emp. Form.C12H18N2S
Mol. Mass.222.35
SMILESCSc1ccc2CCN(C[C@H](C)N)c2c1