Reaction Details
Target5-hydroxytryptamine receptor 2A
LigandBDBM50144840
Substrate/Competitorn/a
Meas. Tech.ChEMBL_2292 (CHEMBL617077)
Ki 351±n/a nM
Citation Bentley, JMAdams, DRBebbington, DBenwell, KRBickerdike, MJDavidson, JEDawson, CEDourish, CTDuncton, MAGaur, SGeorge, ARGiles, PRHamlyn, RJKennett, GAKnight, ARMalcolm, CSMansell, HLMisra, AMonck, NJPratt, RMQuirk, KRoffey, JRVickers, SPCliffe, IA Indoline derivatives as 5-HT(2C) receptor agonists. Bioorg Med Chem Lett14:2367-70 (2004) 
 
5-hydroxytryptamine receptor 2A
Name:5-hydroxytryptamine receptor 2A
Type:undefined
Mol. Mass.:52607.65
Organism:Homo sapiens (Human)
Description:P28223
Residue:471
BDBM50144840
NameBDBM50144840
Synonyms:(S)-2-(6-Bromo-2,3-dihydro-indol-1-yl)-1-methyl-ethylamine VER-3323
TypeSmall organic molecule
Emp. Form.C11H15BrN2
Mol. Mass.255.154
SMILESC[C@H](N)CN1CCc2ccc(Br)cc12