Reaction Details
Target5-hydroxytryptamine receptor 2C
LigandBDBM50144844
Substrate/Competitorn/a
Meas. Tech.ChEMBL_2970 (CHEMBL620618)
Ki 38±n/a nM
Citation Bentley, JMAdams, DRBebbington, DBenwell, KRBickerdike, MJDavidson, JEDawson, CEDourish, CTDuncton, MAGaur, SGeorge, ARGiles, PRHamlyn, RJKennett, GAKnight, ARMalcolm, CSMansell, HLMisra, AMonck, NJPratt, RMQuirk, KRoffey, JRVickers, SPCliffe, IA Indoline derivatives as 5-HT(2C) receptor agonists. Bioorg Med Chem Lett14:2367-70 (2004) 
 
5-hydroxytryptamine receptor 2C
Name:5-hydroxytryptamine receptor 2C
Type:G Protein-Coupled Receptor (GPCR)
Mol. Mass.:51836.79
Organism:Homo sapiens (Human)
Description:P28335
Residue:458
BDBM50144844
NameBDBM50144844
Synonyms:(S)-1-Methyl-2-(2,3,8,9-tetrahydro-7H-pyrano[2,3-g]indol-1-yl)-ethylamine | CHEMBL80482
TypeSmall organic molecule
Emp. Form.C14H20N2O
Mol. Mass.232.3214
SMILESC[C@H](N)CN1CCc2ccc3OCCCc3c12