Reaction Details
Target5-hydroxytryptamine receptor 2C
LigandBDBM50144839
Substrate/Competitorn/a
Meas. Tech.ChEMBL_2970 (CHEMBL620618)
Ki 6.4±n/a nM
Citation Bentley, JMAdams, DRBebbington, DBenwell, KRBickerdike, MJDavidson, JEDawson, CEDourish, CTDuncton, MAGaur, SGeorge, ARGiles, PRHamlyn, RJKennett, GAKnight, ARMalcolm, CSMansell, HLMisra, AMonck, NJPratt, RMQuirk, KRoffey, JRVickers, SPCliffe, IA Indoline derivatives as 5-HT(2C) receptor agonists. Bioorg Med Chem Lett14:2367-70 (2004) 
 
5-hydroxytryptamine receptor 2C
Name:5-hydroxytryptamine receptor 2C
Type:G Protein-Coupled Receptor (GPCR)
Mol. Mass.:51836.79
Organism:Homo sapiens (Human)
Description:P28335
Residue:458
BDBM50144839
NameBDBM50144839
Synonyms:(S)-2-(6-Ethylsulfanyl-5-fluoro-2,3-dihydro-indol-1-yl)-1-methyl-ethylamine | CHEMBL80731
TypeSmall organic molecule
Emp. Form.C13H19FN2S
Mol. Mass.254.367
SMILESCCSc1cc2N(C[C@H](C)N)CCc2cc1F