Reaction Details
Target5-hydroxytryptamine receptor 2A
LigandBDBM50144842
Substrate/Competitorn/a
Meas. Tech.ChEMBL_2263 (CHEMBL617050)
EC50 62±n/a nM
Citation Bentley, JMAdams, DRBebbington, DBenwell, KRBickerdike, MJDavidson, JEDawson, CEDourish, CTDuncton, MAGaur, SGeorge, ARGiles, PRHamlyn, RJKennett, GAKnight, ARMalcolm, CSMansell, HLMisra, AMonck, NJPratt, RMQuirk, KRoffey, JRVickers, SPCliffe, IA Indoline derivatives as 5-HT(2C) receptor agonists. Bioorg Med Chem Lett14:2367-70 (2004) 
 
5-hydroxytryptamine receptor 2A
Name:5-hydroxytryptamine receptor 2A
Type:undefined
Mol. Mass.:52607.65
Organism:Homo sapiens (Human)
Description:P28223
Residue:471
BDBM50144842
NameBDBM50144842
Synonyms:(S)-1-Methyl-2-(2,3,7,8-tetrahydro-furo[2,3-g]indol-1-yl)-ethylamine VER-5384
TypeSmall organic molecule
Emp. Form.C13H18N2O
Mol. Mass.218.2948
SMILESC[C@H](N)CN1CCc2ccc3OCCc3c12