Reaction Details
Target5-hydroxytryptamine receptor 2C
LigandBDBM50144845
Substrate/Competitorn/a
Meas. Tech.ChEMBL_2970 (CHEMBL620618)
Ki 14±n/a nM
Citation Bentley, JMAdams, DRBebbington, DBenwell, KRBickerdike, MJDavidson, JEDawson, CEDourish, CTDuncton, MAGaur, SGeorge, ARGiles, PRHamlyn, RJKennett, GAKnight, ARMalcolm, CSMansell, HLMisra, AMonck, NJPratt, RMQuirk, KRoffey, JRVickers, SPCliffe, IA Indoline derivatives as 5-HT(2C) receptor agonists. Bioorg Med Chem Lett14:2367-70 (2004) 
 
5-hydroxytryptamine receptor 2C
Name:5-hydroxytryptamine receptor 2C
Type:G Protein-Coupled Receptor (GPCR)
Mol. Mass.:51836.79
Organism:Homo sapiens (Human)
Description:P28335
Residue:458
BDBM50144845
NameBDBM50144845
Synonyms:(S)-2-(6-Chloro-5-fluoro-2,3-dihydro-indol-1-yl)-1-methyl-ethylamine | CHEMBL80366
TypeSmall organic molecule
Emp. Form.C11H14ClFN2
Mol. Mass.228.694
SMILESC[C@H](N)CN1CCc2cc(F)c(Cl)cc12