Reaction Details
Target5-hydroxytryptamine receptor 2B
LigandBDBM50144846
Substrate/Competitorn/a
Meas. Tech.ChEBML_2484
Ki 21±n/a nM
Citation Bentley, JMAdams, DRBebbington, DBenwell, KRBickerdike, MJDavidson, JEDawson, CEDourish, CTDuncton, MAGaur, SGeorge, ARGiles, PRHamlyn, RJKennett, GAKnight, ARMalcolm, CSMansell, HLMisra, AMonck, NJPratt, RMQuirk, KRoffey, JRVickers, SPCliffe, IA Indoline derivatives as 5-HT(2C) receptor agonists. Bioorg Med Chem Lett14:2367-70 (2004) 
 
5-hydroxytryptamine receptor 2B
Name:5-hydroxytryptamine receptor 2B
Type:G Protein-Coupled Receptor (GPCR)
Mol. Mass.:54312.47
Organism:Homo sapiens (Human)
Description:Receptor binding assays were performed using human clone stably expressed in CHO cells.
Residue:481
BDBM50144846
NameBDBM50144846
Synonyms:(S)-2-(5-Fluoro-6-methylsulfanyl-2,3-dihydro-indol-1-yl)-1-methyl-ethylamine VER-5593
TypeSmall organic molecule
Emp. Form.C12H17FN2S
Mol. Mass.240.34
SMILESCSc1cc2N(C[C@H](C)N)CCc2cc1F