Reaction Details
TargetEstrogen receptor
LigandBDBM50141155
Substrate/Competitorn/a
Meas. Tech.ChEMBL_67487 (CHEMBL679324)
IC50 6.7±n/a nM
Citation Kim, SWu, JYBirzin, ETFrisch, KChan, WPai, LYYang, YTMosley, RTFitzgerald, PMSharma, NDahllund, JThorsell, AGDiNinno, FRohrer, SPSchaeffer, JMHammond, ML Estrogen receptor ligands. II. Discovery of benzoxathiins as potent, selective estrogen receptor alpha modulators. J Med Chem47:2171-5 (2004) 
 
Estrogen receptor
Name:Estrogen receptor
Type:Protein
Mol. Mass.:66230.44
Organism:Homo sapiens (Human)
Description:P03372
Residue:595
BDBM50141155
NameBDBM50141155
Synonyms:(2S,3S)-3-(4-Hydroxy-phenyl)-2-[4-(2-piperidin-1-yl-ethoxy)-phenyl]-chroman-7-ol | CHEMBL30439
TypeSmall organic molecule
Emp. Form.C28H31NO4
Mol. Mass.445.55
SMILESOc1ccc(cc1)[C@@H]1Cc2ccc(O)cc2O[C@@H]1c1ccc(OCCN2CCCCC2)cc1