Reaction Details
TargetEstrogen receptor
LigandBDBM50144847
Substrate/Competitorn/a
Meas. Tech.ChEMBL_67487 (CHEMBL679324)
IC50 1.6±n/a nM
Citation Kim, SWu, JYBirzin, ETFrisch, KChan, WPai, LYYang, YTMosley, RTFitzgerald, PMSharma, NDahllund, JThorsell, AGDiNinno, FRohrer, SPSchaeffer, JMHammond, ML Estrogen receptor ligands. II. Discovery of benzoxathiins as potent, selective estrogen receptor alpha modulators. J Med Chem47:2171-5 (2004) 
 
Estrogen receptor
Name:Estrogen receptor
Type:Protein
Mol. Mass.:66230.44
Organism:Homo sapiens (Human)
Description:P03372
Residue:595
BDBM50144847
NameBDBM50144847
Synonyms:(2R,3S)-3-(4-Hydroxy-phenyl)-2-[4-(2-piperidin-1-yl-ethoxy)-phenyl]-2,3-dihydro-benzo[1,4]oxathiin-7-ol | CHEMBL71584
TypeSmall organic molecule
Emp. Form.C27H29NO4S
Mol. Mass.463.588
SMILESOc1ccc(cc1)[C@@H]1Sc2ccc(O)cc2O[C@@H]1c1ccc(OCCN2CCCCC2)cc1