Reaction Details
TargetEstrogen receptor
LigandBDBM19441
Substrate/Competitorn/a
Meas. Tech.ChEMBL_67487 (CHEMBL679324)
IC50 1.8±n/a nM
Citation Kim, SWu, JYBirzin, ETFrisch, KChan, WPai, LYYang, YTMosley, RTFitzgerald, PMSharma, NDahllund, JThorsell, AGDiNinno, FRohrer, SPSchaeffer, JMHammond, ML Estrogen receptor ligands. II. Discovery of benzoxathiins as potent, selective estrogen receptor alpha modulators. J Med Chem47:2171-5 (2004) 
 
Estrogen receptor
Name:Estrogen receptor
Type:Protein
Mol. Mass.:66230.44
Organism:Homo sapiens (Human)
Description:P03372
Residue:595
BDBM19441
NameBDBM19441
Synonyms:2-(4-hydroxyphenyl)-3-({4-[2-(piperidin-1-yl)ethoxy]phenyl}carbonyl)-1-benzothiophen-6-ol Evista RALOXIFENE HYDROCHLORIDE Raloxifene (7) [6-hydroxy-2-(4-hydroxyphenyl)-1-benzothiophen-3-yl]-[4-(2-piperidin-1-ylethoxy)phenyl]methanone | cid_11071264
TypeSmall organic molecule
Emp. Form.C28H27NO4S
Mol. Mass.473.583
SMILESOc1ccc(cc1)-c1sc2cc(O)ccc2c1C(=O)c1ccc(OCCN2CCCCC2)cc1