Reaction Details
TargetGABA-A receptor; alpha-2/beta-3/gamma-2
LigandBDBM50007664
Substrate/Competitorn/a
Meas. Tech.ChEMBL_70253 (CHEMBL682712)
Ki 460±n/a nM
Citation Sternfeld, FCarling, RWJelley, RALadduwahetty, TMerchant, KJMoore, KWReeve, AJStreet, LJO'Connor, DSohal, BAtack, JRCook, SSeabrook, GWafford, KTattersall, FDCollinson, NDawson, GRCastro, JLMacLeod, AM Selective, orally active gamma-aminobutyric acidA alpha5 receptor inverse agonists as cognition enhancers. J Med Chem47:2176-9 (2004) 
 
GABA-A receptor; alpha-2/beta-3/gamma-2
Name:GABA-A receptor; alpha-2/beta-3/gamma-2
Type:n/a
Mol. Mass.:n/a
Description:ASSAY_ID of ChEMBL is 2148174
Components:This complex has 3 components.
Component 1
Name:Gamma-aminobutyric acid receptor subunit gamma-2
Synonyms:GABA(A) receptor subunit gamma-2 GBRG2_HUMAN
Type:PROTEIN
Mol. Mass.:54172.74
Organism:Homo sapiens (Human)
Description:EBI_217
Residue:467
Component 2
Name:Gamma-aminobutyric acid receptor subunit beta-3
Synonyms:GABA A receptor alpha-4/beta-3/gamma-2 GABA-A receptor GBRB3_HUMAN | agonist GABA site
Type:PROTEIN
Mol. Mass.:54130.51
Organism:Homo sapiens (Human)
Description:ChEMBL_448071
Residue:473
Component 3
Name:Gamma-aminobutyric acid receptor subunit alpha-2
Synonyms:GABA receptor alpha-2 subunit GBRA2_HUMAN | Gamma-aminobutyric acid receptor subunit alpha-2 (GABRA2)
Type:Protein
Mol. Mass.:51338.78
Organism:Homo sapiens (Human)
Description:P47869
Residue:451
BDBM50007664
NameBDBM50007664
Synonyms:7-chloro-2-methylamino-5-phenyl-3H-1,4-benzodiazepin-4-oxide CDP CHLORDIAZEPOXIDE methaminodiazepoxide
TypeSmall organic molecule
Emp. Form.C16H14ClN3O
Mol. Mass.299.755
SMILESCNC1=Nc2ccc(Cl)cc2C(c2ccccc2)=[N+]([O-])C1